Reaction Details
TargetCholine O-acetyltransferase
LigandBDBM50026479
Substrate/Competitorn/a
Meas. Tech.ChEMBL_27375 (CHEMBL642521)
Ki 40000000±n/a nM
Citation Cohen, SGChishti, SBElkind, JLReese, HCohen, JB Effects of charge, volume, and surface on binding of inhibitor and substrate moieties to acetylcholinesterase. J Med Chem28:1309-13 (1985) Choline O-acetyltransferase
Name:Choline O-acetyltransferase
Type:Enzyme Catalytic Domain
Mol. Mass.:71875.58
Organism:RAT
Description:Choline Acetyltransferase 0 RAT::P32738
Residue:640
BDBM50026479
NameBDBM50026479
Synonyms:2-Methylsulfanyl-ethanol | CHEMBL277871
TypeSmall organic molecule
Emp. Form.C3H8OS
Mol. Mass.92.16
SMILESCSCCO