Reaction Details
TargetAlpha-1A adrenergic receptor
LigandBDBM50026636
Substrate/Competitorn/a
Meas. Tech.ChEBML_33092
Ki 940±n/a nM
Citation Saari, WSHalczenko, WKing, SWHuff, JRGuare, JPHunt, CARandall, WCAnderson, PSLotti, VJTaylor, DA Pyridinylpiperazines, a new class of selective alpha 2-adrenoceptor antagonists. J Med Chem26:1696-701 (1984) Alpha-1A adrenergic receptor
Name:Alpha-1A adrenergic receptor
Type:Enzyme Catalytic Domain
Mol. Mass.:51492.08
Organism:CALF
Description:adrenergic Alpha1 0 CALF
Residue:466
BDBM50026636
NameBDBM50026636
Synonyms:17alpha-hydroxy-20alpha-yohimban-16beta-carboxylic acid methyl ester RAUWOLSCINE HYDROCHLORIDE corynanthidine mesoyohimbine methyl 17alpha-hydroxy-20alpha-yohimban-16beta-carboxylate | rauwolscine
TypeSmall organic molecule
Emp. Form.C21H26N2O3
Mol. Mass.354.4427
SMILESCOC(=O)[C@@H]1[C@@H](O)CC[C@@H]2CN3CCc4c([nH]c5ccccc45)[C@@H]3C[C@H]12