Reaction Details
TargetDNA polymerase beta
LigandBDBM50027112
Substrate/Competitorn/a
Meas. Tech.ChEBML_50773
IC50 15000±n/a nM
Citation Wu, RSWolpert-DeFilippes, MKQuinn, FR Quantitative structure--activity correlations of rifamycins as inhibitors of viral RNA-directed DNA polymerase and mammalian alpha and beta DNA polymerases. J Med Chem23:256-61 (1980) DNA polymerase beta
Name:DNA polymerase beta
Type:PROTEIN
Mol. Mass.:38297.87
Organism:Mus musculus
Description:ChEMBL_50773
Residue:335
BDBM50027112
NameBDBM50027112
Synonyms:2,15,17,29-tetrahydroxy-11-methoxy-3,7,12,14,16,18,22-heptamethyl-26-N-Cyclopentadecyl-N'-methylene-hydrazine-6,23-dioxo-8,30-dioxa-24-azatetracyclo[23.3.1.14,7.05,28]triaconta-1(28),2,4,9,19,21,25(29),26-octaen-13-yl acetate | CHEMBL441064
TypeSmall organic molecule
Emp. Form.C53H77N3O11
Mol. Mass.932.192
SMILES[#6]-[#8]-[#6]-1\[#6]=[#6]\[#8]C2([#6])[#8]-c3c(-[#6]2=O)c2cc(-[#6]-[#7]\[#7]=[#6]-4\[#6]-[#6]-[#6]-[#6]-[#6]-[#6]-[#6]-[#6]-[#6]-[#6]-[#6]-[#6]-[#6]-[#6]-4)c(-[#7]-[#6](=O)-[#6](-[#6])=[#6]-[#6]=[#6]-[#6](-[#6])-[#6](-[#8])-[#6](-[#6])-[#6](-[#8])-[#6](-[#6])-[#6](-[#8]-[#6](-[#6])=O)-[#6]-1-[#6])c(-[#8])c2c(-[#8])c3-[#6]