Reaction Details
TargetKappa-type opioid receptor
LigandBDBM50000091
Substrate/Competitorn/a
Meas. Tech.ChEBML_145676
IC50 47±n/a nM
Citation Rice, KCKonicki, PEQuirion, RBurke, TRPert, CB Synthesis and pharmacological characterization of (+/-)-5,9 alpha-dimethyl-2-[2-(4-fluorophenyl)ethyl]-2'-hydroxy-6,7-benzomorphan (fluorophen), a ligand suitable for visualization of opiate receptors in vivo. J Med Chem26:1643-5 (1983) Kappa-type opioid receptor
Name:Kappa-type opioid receptor
Type:G Protein-Coupled Receptor (GPCR)
Mol. Mass.:42648.76
Organism:Homo sapiens (Human)
Description:P41145
Residue:380
BDBM50000091
NameBDBM50000091
Synonyms:(6S,11R)-3-Cyclopropylmethyl-6-ethyl-8-hydroxy-11-methyl-3,4,5,6-tetrahydro-2H-2,6-methano-benzo[d]azocin-1-one 3-Cyclopropylmethyl-6-ethyl-8-hydroxy-11-methyl-3,4,5,6-tetrahydro-2H-2,6-methano-benzo[d]azocin-1-one 3-Cyclopropylmethyl-6-ethyl-8-hydroxy-11-methyl-3,4,5,6-tetrahydro-2H-2,6-methano-benzo[d]azocin-1-one(Ethylketazocine, EKC) EKC | EKC(-)
TypeSmall organic molecule
Emp. Form.C19H25NO2
Mol. Mass.299.4073
SMILESCC[C@]12CCN(CC3CC3)C([C@@H]1C)C(=O)c1ccc(O)cc21