Reaction Details
TargetKappa-type opioid receptor
LigandBDBM50027790
Substrate/Competitorn/a
Meas. Tech.ChEBML_145676
IC50 157±n/a nM
Citation Rice, KCKonicki, PEQuirion, RBurke, TRPert, CB Synthesis and pharmacological characterization of (+/-)-5,9 alpha-dimethyl-2-[2-(4-fluorophenyl)ethyl]-2'-hydroxy-6,7-benzomorphan (fluorophen), a ligand suitable for visualization of opiate receptors in vivo. J Med Chem26:1643-5 (1983) Kappa-type opioid receptor
Name:Kappa-type opioid receptor
Type:G Protein-Coupled Receptor (GPCR)
Mol. Mass.:42648.76
Organism:Homo sapiens (Human)
Description:P41145
Residue:380
BDBM50027790
NameBDBM50027790
Synonyms:3,5-Dibromo-2-hydroxy-N-(3-trifluoromethyl-phenyl)-benzamide CHEMBL283552 | Fluorosalan
TypeSmall organic molecule
Emp. Form.C14H8Br2F3NO2
Mol. Mass.439.022
SMILESOc1c(Br)cc(Br)cc1C(=O)Nc1cccc(c1)C(F)(F)F