Reaction Details
TargetAldo-keto reductase family 1 member B1 [K65Q]
LigandBDBM16312
Substrate/Competitorn/a
Meas. Tech.ChEBML_31634
IC50 1500±n/a nM
Citation Sestanj, KBellini, FFung, SAbraham, NTreasurywala, AHumber, LSimard-Duquesne, NDvornik, D N-[5-(trifluoromethyl)-6-methoxy-1-naphthalenyl]thioxomethyl]- N-methylglycine (Tolrestat), a potent, orally active aldose reductase inhibitor. J Med Chem27:255-6 (1984) Aldo-keto reductase family 1 member B1 [K65Q]
Name:Aldo-keto reductase family 1 member B1 [K65Q]
Type:Protein
Mol. Mass.:35916.27
Organism:Bos taurus (Cattle)
Description:P16116[K65Q]
Residue:315
BDBM16312
NameBDBM16312
Synonyms:(4S)-6-fluoro-2,3-dihydrospiro[1-benzopyran-4,4'-imidazolidine]-2',5'-dione Sorbinil
TypeSmall organic molecule
Emp. Form.C11H9FN2O3
Mol. Mass.236.1992
SMILESFc1ccc2OCC[C@]3(NC(=O)NC3=O)c2c1