Reaction Details
TargetDihydrofolate reductase
LigandBDBM50027971
Substrate/Competitorn/a
Meas. Tech.ChEBML_54924
Ki 0.900000±n/a nM
Citation Birdsall, BFeeney, JPascual, CRoberts, GCKompis, IThen, RLMüller, KKroehn, A A 1H NMR study of the interactions and conformations of rationally designed brodimoprim analogues in complexes with Lactobacillus casei dihydrofolate reductase. J Med Chem27:1672-6 (1985) Dihydrofolate reductase
Name:Dihydrofolate reductase
Type:PROTEIN
Mol. Mass.:18437.08
Organism:Lactobacillus casei
Description:ChEMBL_1357878
Residue:163
BDBM50027971
NameBDBM50027971
Synonyms:4-[2-Bromo-5-(2,4-diamino-pyrimidin-5-ylmethyl)-3-methoxy-phenoxy]-butyric acid | CHEMBL31887
TypeSmall organic molecule
Emp. Form.C16H19BrN4O4
Mol. Mass.411.25
SMILESCOc1cc(Cc2cnc(N)nc2N)cc(OCCCC(O)=O)c1Br