Reaction Details
TargetDihydrofolate reductase
LigandBDBM50027976
Substrate/Competitorn/a
Meas. Tech.ChEBML_54924
Ki 4.1±n/a nM
Citation Birdsall, BFeeney, JPascual, CRoberts, GCKompis, IThen, RLMüller, KKroehn, A A 1H NMR study of the interactions and conformations of rationally designed brodimoprim analogues in complexes with Lactobacillus casei dihydrofolate reductase. J Med Chem27:1672-6 (1985) Dihydrofolate reductase
Name:Dihydrofolate reductase
Type:PROTEIN
Mol. Mass.:18437.08
Organism:Lactobacillus casei
Description:ChEMBL_1357878
Residue:163
BDBM50027976
NameBDBM50027976
Synonyms:CHEMBL45202 | {3-[2-Bromo-5-(2,4-diamino-pyrimidin-5-ylmethyl)-3-methoxy-phenoxy]-propionylamino}-acetic acid
TypeSmall organic molecule
Emp. Form.C17H20BrN5O5
Mol. Mass.454.275
SMILESCOc1cc(Cc2cnc(N)nc2N)cc(OCCC(=O)NCC(O)=O)c1Br