Reaction Details
TargetCholinesterase
LigandBDBM83449
Substrate/Competitorn/a
Meas. Tech.ChEMBL_41570 (CHEMBL654864)
Ki 520±n/a nM
Citation Kalir, ATeomy, SAmir, AFuchs, PLee, SAHolsztynska, EJRocki, WDomino, EF N-allyl analogues of phencyclidine: chemical synthesis and pharmacological properties. J Med Chem27:1267-71 (1984) Cholinesterase
Name:Cholinesterase
Type:Protein
Mol. Mass.:68465.99
Organism:Mus musculus (Mouse)
Description:Q03311
Residue:603
BDBM83449
NameBDBM83449
Synonyms:1-(1-phenylcyclohexyl)piperidine;hydrochloride PCP PHENCYCLIDINE SMR001338811 | cid_9795678
TypeSmall organic molecule
Emp. Form.C17H25N
Mol. Mass.243.3871
SMILESC1CCN(CC1)C1(CCCCC1)c1ccccc1