Reaction Details
TargetCholinesterase
LigandBDBM50028055
Substrate/Competitorn/a
Meas. Tech.ChEBML_41572
Ki 57544±n/a nM
Citation Kalir, ATeomy, SAmir, AFuchs, PLee, SAHolsztynska, EJRocki, WDomino, EF N-allyl analogues of phencyclidine: chemical synthesis and pharmacological properties. J Med Chem27:1267-71 (1984) Cholinesterase
Name:Cholinesterase
Type:Protein
Mol. Mass.:68465.99
Organism:Mus musculus (Mouse)
Description:Q03311
Residue:603
BDBM50028055
NameBDBM50028055
Synonyms:CHEMBL279924 Eticyclidine
TypeSmall organic molecule
Emp. Form.C14H21N
Mol. Mass.203.3232
SMILESCCNC1(CCCCC1)c1ccccc1