Reaction Details
TargetAdenosine deaminase
LigandBDBM50088426
Substrate/Competitorn/a
Meas. Tech.ChEBML_31100
Ki 9900±n/a nM
Citation Vince, RBrownell, JDaluge, S Carbocyclic analogues of xylofuranosylpurine nucleosides. Synthesis and antitumor activity. J Med Chem27:1358-60 (1984) Adenosine deaminase
Name:Adenosine deaminase
Type:PROTEIN
Mol. Mass.:39984.63
Organism:Mus musculus
Description:ChEMBL_31100
Residue:352
BDBM50088426
NameBDBM50088426
Synonyms:(1R,2S,3R,5R)-3-(6-amino-9H-purin-9-yl)-5-(hydroxymethyl)cyclopentane-1,2-diol CHEMBL49935
TypeSmall organic molecule
Emp. Form.C11H15N5O3
Mol. Mass.265.2685
SMILESNc1ncnc2n(cnc12)[C@@H]1C[C@H](CO)[C@@H](O)[C@H]1O