Reaction Details
TargetDihydrofolate reductase
LigandBDBM50028132
Substrate/Competitorn/a
Meas. Tech.ChEBML_53634
IC50 440±n/a nM
Citation Rosowsky, AForsch, RAYu, CSLazarus, HBeardsley, GP Methotrexate analogues. 21. Divergent influence of alkyl chain length on the dihydrofolate reductase affinity and cytotoxicity of methotrexate monoesters. J Med Chem27:605-9 (1984) Dihydrofolate reductase
Name:Dihydrofolate reductase
Type:Enzyme
Mol. Mass.:21603.71
Organism:Bos taurus (Cattle)
Description:P00376
Residue:187
BDBM50028132
NameBDBM50028132
Synonyms:2-{4-[(2,4-Diamino-pteridin-6-ylmethyl)-methyl-amino]-benzoylamino}-pentanedioic acid 1-dodecyl ester | CHEMBL345807
TypeSmall organic molecule
Emp. Form.C32H46N8O5
Mol. Mass.622.7582
(=O)C(CCC(O)=O)NC(=O)c1ccc(cc1)N(C)Cc1cnc2nc(N)nc(N)c2n1