Reaction Details
TargetDihydrofolate reductase
LigandBDBM50028130
Substrate/Competitorn/a
Meas. Tech.ChEBML_53634
IC50 5.4±n/a nM
Citation Rosowsky, AForsch, RAYu, CSLazarus, HBeardsley, GP Methotrexate analogues. 21. Divergent influence of alkyl chain length on the dihydrofolate reductase affinity and cytotoxicity of methotrexate monoesters. J Med Chem27:605-9 (1984) Dihydrofolate reductase
Name:Dihydrofolate reductase
Type:Enzyme
Mol. Mass.:21603.71
Organism:Bos taurus (Cattle)
Description:P00376
Residue:187
BDBM50028130
NameBDBM50028130
Synonyms:(gamma-n-Bu)2-{4-[(2,4-Diamino-pteridin-6-ylmethyl)-methyl-amino]-benzoylamino}-pentanedioic acid 5-butyl ester | CHEMBL155016
TypeSmall organic molecule
Emp. Form.C24H30N8O5
Mol. Mass.510.5456
SMILESCCCCOC(=O)CCC(NC(=O)c1ccc(cc1)N(C)Cc1cnc2nc(N)nc(N)c2n1)C(O)=O