Reaction Details
TargetCytochrome P450 11B1, mitochondrial
LigandBDBM50028169
Substrate/Competitorn/a
Meas. Tech.ChEBML_192
IC50 660.0±n/a nM
Citation Hays, SJTobes, MCGildersleeve, DLWieland, DMBeierwaltes, WH Structure-activity relationship study of the inhibition of adrenal cortical 11 beta-hydroxylase by new metyrapone analogues. J Med Chem27:15-9 (1984) Cytochrome P450 11B1, mitochondrial
Name:Cytochrome P450 11B1, mitochondrial
Type:PROTEIN
Mol. Mass.:57863.81
Organism:Bos taurus
Description:ChEMBL_1345884
Residue:503
BDBM50028169
NameBDBM50028169
Synonyms:3-(1,1-Dimethyl-2-phenyl-ethyl)-pyridine | CHEMBL440299
TypeSmall organic molecule
Emp. Form.C15H17N
Mol. Mass.211.3022
SMILESCC(C)(Cc1ccccc1)c1cccnc1