Reaction Details
TargetcGMP-dependent 3',5'-cyclic phosphodiesterase
LigandBDBM50028190
Substrate/Competitorn/a
Meas. Tech.ChEBML_217498
Ki 600000±n/a nM
Citation Selvig, KRuud-Christensen, MAasen, AJ Optical resolution, absolute configuration, and activity of the enantiomers of proxyphylline. J Med Chem26:1514-8 (1983) cGMP-dependent 3',5'-cyclic phosphodiesterase
Name:cGMP-dependent 3',5'-cyclic phosphodiesterase
Type:Enzyme Catalytic Domain
Mol. Mass.:105691.58
Organism:Homo sapiens (Human)
Description:O00408
Residue:941
BDBM50028190
NameBDBM50028190
Synonyms:7-(2-Hydroxy-propyl)-1,3-dimethyl-3,7-dihydro-purine-2,6-dione CHEMBL37390 Proxyphylline
TypeSmall organic molecule
Emp. Form.C10H14N4O3
Mol. Mass.238.2432
SMILESCC(O)Cn1cnc2n(C)c(=O)n(C)c(=O)c12