Reaction Details
TargetDihydrofolate reductase
LigandBDBM50026300
Substrate/Competitorn/a
Meas. Tech.ChEBML_54543
Ki 0.024000±n/a nM
Citation Kuyper, LFRoth, BBaccanari, DPFerone, RBeddell, CRChampness, JNStammers, DKDann, JGNorrington, FEBaker, DJGoodford, PJ Receptor-based design of dihydrofolate reductase inhibitors: comparison of crystallographically determined enzyme binding with enzyme affinity in a series of carboxy-substituted trimethoprim analogues. J Med Chem25:1120-2 (1983) Dihydrofolate reductase
Name:Dihydrofolate reductase
Type:n/a
Mol. Mass.:17532.46
Organism:Escherichia coli
Description:n/a
Residue:157
BDBM50026300
NameBDBM50026300
Synonyms:6-[5-(2,4-Diamino-pyrimidin-5-ylmethyl)-2,3-dimethoxy-phenoxy]-hexanoic acid | CHEMBL14001
TypeSmall organic molecule
Emp. Form.C19H26N4O5
Mol. Mass.390.4335
SMILESCOc1cc(Cc2cnc(N)nc2N)cc(OCCCCCC(O)=O)c1OC