Reaction Details
TargetDNA topoisomerase 3
LigandBDBM50028342
Substrate/Competitorn/a
Meas. Tech.ChEBML_54508
Ki 930.0±n/a nM
Citation Wright, GEBrown, NC Inhibitors of Bacillus subtilis DNA polymerase III. 6-Anilinouracils and 6-(alkylamino)uracils. J Med Chem23:34-8 (1980) DNA topoisomerase 3
Name:DNA topoisomerase 3
Type:PROTEIN
Mol. Mass.:81515.22
Organism:Bacillus subtilis
Description:ChEMBL_54525
Residue:727
BDBM50028342
NameBDBM50028342
Synonyms:6-(3,4-Dichloro-phenylamino)-1H-pyrimidine-2,4-dione | CHEMBL52034
TypeSmall organic molecule
Emp. Form.C10H7Cl2N3O2
Mol. Mass.272.087
SMILESClc1ccc(Nc2cc(=O)[nH]c(=O)[nH]2)cc1Cl