Reaction Details
TargetThymidylate synthase
LigandBDBM50028376
Substrate/Competitorn/a
Meas. Tech.ChEBML_217700
Ki 1900±n/a nM
Citation Barr, PJNolan, PASanti, DVRobins, MJ Inhibition of thymidylate synthetase by 5-alkynyl-2'-deoxyuridylates. J Med Chem24:1385-8 (1982) Thymidylate synthase
Name:Thymidylate synthase
Type:Enzyme
Mol. Mass.:36576.54
Organism:Lactobacillus casei
Description:n/a
Residue:316
BDBM50028376
NameBDBM50028376
Synonyms:CHEMBL3143870 | Phosphoric acid mono-{3-hydroxy-5-[5-(4-hydroxy-but-1-ynyl)-2,4-dioxo-3,4-dihydro-2H-pyrimidin-1-yl]-tetrahydro-furan-2-ylmethyl} ester
TypeSmall organic molecule
Emp. Form.C13H17N2O9P
Mol. Mass.376.2558
SMILESOCCC#Cc1cn([C@H]2C[C@H](O)[C@@H](COP(O)(O)=O)O2)c(=O)[nH]c1=O