Reaction Details
TargetPhenylalanine-4-hydroxylase
LigandBDBM50028427
Substrate/Competitorn/a
Meas. Tech.ChEBML_154856
Ki 125000±n/a nM
Citation Henrie, RNLazarus, RABenkovic, SJ Preparation of 2-amino-4(3H)-oxopyrimido[5,4-b] [1,4]thiazines (5-thiapterins) and their evaluation as cofactors for phenylalanine hydroxylase. J Med Chem26:559-63 (1983) Phenylalanine-4-hydroxylase
Name:Phenylalanine-4-hydroxylase
Type:PROTEIN
Mol. Mass.:51817.61
Organism:Rattus norvegicus
Description:ChEMBL_154856
Residue:453
BDBM50028427
NameBDBM50028427
Synonyms:2-Amino-6-methyl-5-oxo-5,6,7,8-tetrahydro-3H-5lambda*4*-pyrimido[5,4-b][1,4]thiazin-4-one | CHEMBL345752
TypeSmall organic molecule
Emp. Form.C7H8N4O2S
Mol. Mass.212.229
SMILESCC1=CNc2nc(N)[nH]c(=O)c2S1=O