Reaction Details
TargetPhenylethanolamine N-methyltransferase
LigandBDBM10758
Substrate/Competitorn/a
Meas. Tech.ChEBML_142786
Ki 467000±n/a nM
Citation Rafferty, MFWilson, DSMonn, JAKrass, PBorchardt, RTGrunewald, GL Importance of the aromatic ring in adrenergic amines. 7. Comparison of the stereoselectivity of norepinephrine N-methyltransferase for aromatic vs. nonaromatic substrates and inhibitors. J Med Chem25:1198-204 (1983) Phenylethanolamine N-methyltransferase
Name:Phenylethanolamine N-methyltransferase
Type:Enzyme
Mol. Mass.:30916.97
Organism:Bos taurus (bovine)
Description:n/a
Residue:283
BDBM10758
NameBDBM10758
Synonyms:14C-phenylethylamine CHEMBL610 | phenylethylamine
TypeSmall organic molecule
Emp. Form.C8H11N
Mol. Mass.121.1796
SMILESNCCc1ccccc1