Reaction Details
TargetPhenylethanolamine N-methyltransferase
LigandBDBM50028798
Substrate/Competitorn/a
Meas. Tech.ChEBML_152416
IC50 72000±n/a nM
Citation Vincek, WCAldrich, CSBorchardt, RTGrunewald, GL Importance of the aromatic ring in adrenergic amines. 5. Nonaromatic analogues of phenylethanolamine as inhibitors of phenylethanolamine N-methyltransferase: role of hydrophobic and steric interactions. J Med Chem24:7-12 (1981) Phenylethanolamine N-methyltransferase
Name:Phenylethanolamine N-methyltransferase
Type:Enzyme
Mol. Mass.:30916.97
Organism:Bos taurus (bovine)
Description:n/a
Residue:283
BDBM50028798
NameBDBM50028798
Synonyms:1-Trimethylsilanyloxy-cyclooctanecarbonitrile | CHEMBL18878
TypeSmall organic molecule
Emp. Form.C12H23NOSi
Mol. Mass.225.4026
SMILESC[Si](C)(C)OC1(CCCCCCC1)C#N