Reaction Details
TargetPhenylethanolamine N-methyltransferase
LigandBDBM50028803
Substrate/Competitorn/a
Meas. Tech.ChEBML_152416
IC50 345000±n/a nM
Citation Vincek, WCAldrich, CSBorchardt, RTGrunewald, GL Importance of the aromatic ring in adrenergic amines. 5. Nonaromatic analogues of phenylethanolamine as inhibitors of phenylethanolamine N-methyltransferase: role of hydrophobic and steric interactions. J Med Chem24:7-12 (1981) Phenylethanolamine N-methyltransferase
Name:Phenylethanolamine N-methyltransferase
Type:Enzyme
Mol. Mass.:30916.97
Organism:Bos taurus (bovine)
Description:n/a
Residue:283
BDBM50028803
NameBDBM50028803
Synonyms:1-Amino-hexan-2-ol | CHEMBL18843
TypeSmall organic molecule
Emp. Form.C6H15NO
Mol. Mass.117.1894
SMILESCCCCC(O)CN