Reaction Details
TargetPhenylethanolamine N-methyltransferase
LigandBDBM50028817
Substrate/Competitorn/a
Meas. Tech.ChEBML_152416
IC50 216000±n/a nM
Citation Vincek, WCAldrich, CSBorchardt, RTGrunewald, GL Importance of the aromatic ring in adrenergic amines. 5. Nonaromatic analogues of phenylethanolamine as inhibitors of phenylethanolamine N-methyltransferase: role of hydrophobic and steric interactions. J Med Chem24:7-12 (1981) Phenylethanolamine N-methyltransferase
Name:Phenylethanolamine N-methyltransferase
Type:Enzyme
Mol. Mass.:30916.97
Organism:Bos taurus (bovine)
Description:n/a
Residue:283
BDBM50028817
NameBDBM50028817
Synonyms:1-octanal CHEMBL18407 Kaprylaldehyd Oktanal aldehyde C-8 caprylic aldehyde n-octaldehyde n-octyl aldehyde octanal octanoic aldehyde | octylaldehyde
TypeSmall organic molecule
Emp. Form.C8H16O
Mol. Mass.128.212
SMILESCCCCCCCC=O