Reaction Details
TargetPhenylethanolamine N-methyltransferase
LigandBDBM50028821
Substrate/Competitorn/a
Meas. Tech.ChEBML_152416
IC50 314000±n/a nM
Citation Vincek, WCAldrich, CSBorchardt, RTGrunewald, GL Importance of the aromatic ring in adrenergic amines. 5. Nonaromatic analogues of phenylethanolamine as inhibitors of phenylethanolamine N-methyltransferase: role of hydrophobic and steric interactions. J Med Chem24:7-12 (1981) Phenylethanolamine N-methyltransferase
Name:Phenylethanolamine N-methyltransferase
Type:Enzyme
Mol. Mass.:30916.97
Organism:Bos taurus (bovine)
Description:n/a
Residue:283
BDBM50028821
NameBDBM50028821
Synonyms:1-Amino-heptan-2-ol | CHEMBL18576
TypeSmall organic molecule
Emp. Form.C7H17NO
Mol. Mass.131.216
SMILESCCCCCC(O)CN