Reaction Details
TargetPhenylethanolamine N-methyltransferase
LigandBDBM50028838
Substrate/Competitorn/a
Meas. Tech.ChEBML_152416
IC50 17000±n/a nM
Citation Vincek, WCAldrich, CSBorchardt, RTGrunewald, GL Importance of the aromatic ring in adrenergic amines. 5. Nonaromatic analogues of phenylethanolamine as inhibitors of phenylethanolamine N-methyltransferase: role of hydrophobic and steric interactions. J Med Chem24:7-12 (1981) Phenylethanolamine N-methyltransferase
Name:Phenylethanolamine N-methyltransferase
Type:Enzyme
Mol. Mass.:30916.97
Organism:Bos taurus (bovine)
Description:n/a
Residue:283
BDBM50028838
NameBDBM50028838
Synonyms:1-Trimethylsilanyloxy-cyclononanecarbonitrile | CHEMBL278693
TypeSmall organic molecule
Emp. Form.C13H25NOSi
Mol. Mass.239.4292
SMILESC[Si](C)(C)OC1(CCCCCCCC1)C#N