Reaction Details
TargetSqualene synthase
LigandBDBM50029167
Substrate/Competitorn/a
Meas. Tech.ChEMBL_202111 (CHEMBL808969)
IC50 8800.0±n/a nM
Citation Brown, GRButlin, RJChapman, SEakin, MAFoubister, AJFreeman, SGriffiths, DHarrison, PJJohnson, MCMallion, KB Phenoxypropylamines: a new series of squalene synthase inhibitors. J Med Chem38:4157-60 (1995) Squalene synthase
Name:Squalene synthase
Type:PROTEIN
Mol. Mass.:48109.41
Organism:Rattus norvegicus
Description:ChEMBL_1336736
Residue:416
BDBM50029167
NameBDBM50029167
Synonyms:1-(2-Benzyl-phenoxy)-3-isopropylamino-propan-2-ol | CHEMBL335724
TypeSmall organic molecule
Emp. Form.C19H25NO2
Mol. Mass.299.4073
SMILESCC(C)NCC(O)COc1ccccc1Cc1ccccc1