Reaction Details
TargetSqualene synthase
LigandBDBM50029177
Substrate/Competitorn/a
Meas. Tech.ChEMBL_202111 (CHEMBL808969)
IC50 0.05±n/a nM
Citation Brown, GRButlin, RJChapman, SEakin, MAFoubister, AJFreeman, SGriffiths, DHarrison, PJJohnson, MCMallion, KB Phenoxypropylamines: a new series of squalene synthase inhibitors. J Med Chem38:4157-60 (1995) Squalene synthase
Name:Squalene synthase
Type:PROTEIN
Mol. Mass.:48109.41
Organism:Rattus norvegicus
Description:ChEMBL_1336736
Residue:416
BDBM50029177
NameBDBM50029177
Synonyms:CHEMBL134337 | Propionic acid 3-allyl-4-(3-isopropylamino-propoxy)-phenyl ester
TypeSmall organic molecule
Emp. Form.C18H27NO3
Mol. Mass.305.4119
SMILESCCC(=O)Oc1ccc(OCCCNC(C)C)c(CC=C)c1