Reaction Details
TargetEndothelin receptor type B
LigandBDBM50029352
Substrate/Competitorn/a
Meas. Tech.ChEMBL_64010 (CHEMBL671391)
IC50 18000±n/a nM
Citation Fukami, TNagase, TFujita, KHayama, TNiiyama, KMase, TNakajima, SFukuroda, TSaeki, TNishikibe, M Structure-activity relationships of cyclic pentapeptide endothelin A receptor antagonists. J Med Chem38:4309-24 (1995) Endothelin receptor type B
Name:Endothelin receptor type B
Type:PROTEIN
Mol. Mass.:49616.89
Organism:Sus scrofa
Description:ChEMBL_63872
Residue:443
BDBM50029352
NameBDBM50029352
Synonyms:CHEMBL336033 | [(5S,8S,11R,14S,16aR)-8-(1H-Indol-3-ylmethyl)-11-isobutyl-14-isopropyl-4,7,10,13,16-pentaoxo-hexadecahydro-3a,6,9,12,15-pentaaza-cyclopentacyclopentadecen-5-yl]-acetic acid
TypeSmall organic molecule
Emp. Form.C31H42N6O7
Mol. Mass.610.7012
SMILESCC(C)C[C@H]1NC(=O)[C@@H](NC(=O)[C@H]2CCCN2C(=O)[C@H](CC(O)=O)NC(=O)[C@H](Cc2c[nH]c3ccccc23)NC1=O)C(C)C