Reaction Details
TargetEndothelin receptor type B
LigandBDBM50029353
Substrate/Competitorn/a
Meas. Tech.ChEMBL_63701 (CHEMBL672254)
IC50 55000±n/a nM
Citation Fukami, TNagase, TFujita, KHayama, TNiiyama, KMase, TNakajima, SFukuroda, TSaeki, TNishikibe, M Structure-activity relationships of cyclic pentapeptide endothelin A receptor antagonists. J Med Chem38:4309-24 (1995) Endothelin receptor type B
Name:Endothelin receptor type B
Type:Enzyme Catalytic Domain
Mol. Mass.:49664.00
Organism:Homo sapiens (Human)
Description:ENDOTHELIN B EDNRB HUMAN::P24530
Residue:442
BDBM50029353
NameBDBM50029353
Synonyms:CHEMBL414165 | [(5S,8S,11R,14R,16aR)-8-(1H-Indol-3-ylmethyl)-11-isobutyl-4,7,10,13,16-pentaoxo-14-thiophen-2-yl-hexadecahydro-3a,6,9,12,15-pentaaza-cyclopentacyclopentadecen-5-yl]-acetic acid
TypeSmall organic molecule
Emp. Form.C32H38N6O7S
Mol. Mass.650.745
SMILESCC(C)C[C@H]1NC(=O)[C@@H](NC(=O)[C@H]2CCCN2C(=O)[C@H](CC(O)=O)NC(=O)[C@H](Cc2c[nH]c3ccccc23)NC1=O)c1cccs1