Reaction Details
TargetEndothelin receptor type B
LigandBDBM50029354
Substrate/Competitorn/a
Meas. Tech.ChEMBL_63701 (CHEMBL672254)
IC50 21000±n/a nM
Citation Fukami, TNagase, TFujita, KHayama, TNiiyama, KMase, TNakajima, SFukuroda, TSaeki, TNishikibe, M Structure-activity relationships of cyclic pentapeptide endothelin A receptor antagonists. J Med Chem38:4309-24 (1995) Endothelin receptor type B
Name:Endothelin receptor type B
Type:Enzyme Catalytic Domain
Mol. Mass.:49664.00
Organism:Homo sapiens (Human)
Description:ENDOTHELIN B EDNRB HUMAN::P24530
Residue:442
BDBM50029354
NameBDBM50029354
Synonyms:CHEMBL133257 | [(5S,8S,11R,14S,16aR)-14-Cyclopentyl-8-(1H-indol-3-ylmethyl)-11-isobutyl-4,7,10,13,16-pentaoxo-hexadecahydro-3a,6,9,12,15-pentaaza-cyclopentacyclopentadecen-5-yl]-acetic acid
TypeSmall organic molecule
Emp. Form.C33H44N6O7
Mol. Mass.636.7385
SMILESCC(C)C[C@H]1NC(=O)[C@@H](NC(=O)[C@H]2CCCN2C(=O)[C@H](CC(O)=O)NC(=O)[C@H](Cc2c[nH]c3ccccc23)NC1=O)C1CCCC1