Reaction Details
TargetEndothelin-1 receptor
LigandBDBM50407570
Substrate/Competitorn/a
Meas. Tech.ChEMBL_65814 (CHEMBL679716)
IC50 18±n/a nM
Citation Fukami, TNagase, TFujita, KHayama, TNiiyama, KMase, TNakajima, SFukuroda, TSaeki, TNishikibe, M Structure-activity relationships of cyclic pentapeptide endothelin A receptor antagonists. J Med Chem38:4309-24 (1995) Endothelin-1 receptor
Name:Endothelin-1 receptor
Type:PROTEIN
Mol. Mass.:48707.29
Organism:Sus scrofa
Description:ChEMBL_65803
Residue:427
BDBM50407570
NameBDBM50407570
Synonyms:CHEMBL2370825
TypeSmall organic molecule
Emp. Form.C31H42N6O8
Mol. Mass.626.7006
SMILES[H][C@]12C[C@@H](O)CN1C(=O)[C@H](CC(O)=O)NC(=O)[C@H](Cc1c[nH]c3ccccc13)NC(=O)[C@@H](CC(C)C)NC(=O)[C@@H](NC2=O)C(C)C