Reaction Details
TargetEndothelin-1 receptor
LigandBDBM50407615
Substrate/Competitorn/a
Meas. Tech.ChEMBL_65814 (CHEMBL679716)
IC50 18±n/a nM
Citation Fukami, TNagase, TFujita, KHayama, TNiiyama, KMase, TNakajima, SFukuroda, TSaeki, TNishikibe, M Structure-activity relationships of cyclic pentapeptide endothelin A receptor antagonists. J Med Chem38:4309-24 (1995) Endothelin-1 receptor
Name:Endothelin-1 receptor
Type:PROTEIN
Mol. Mass.:48707.29
Organism:Sus scrofa
Description:ChEMBL_65803
Residue:427
BDBM50407615
NameBDBM50407615
Synonyms:CHEMBL343516
TypeSmall organic molecule
Emp. Form.C32H42N6O8
Mol. Mass.638.7113
SMILESCC(C)C[C@H]1NC(=O)[C@@H](NC(=O)[C@H]2CCCN2C(=O)[C@H](CC(O)=O)NC(=O)[C@H](Cc2cn(C=O)c3ccccc23)NC1=O)C(C)C