Reaction Details
TargetTumor necrosis factor receptor superfamily member 16
LigandBDBM50029496
Substrate/Competitorn/a
Meas. Tech.ChEMBL_144433 (CHEMBL753643)
IC50 3100±n/a nM
Citation Jaen, JCLaborde, EBucsh, RACaprathe, BWSorenson, RJFergus, JSpiegel, KMarks, JDickerson, MRDavis, RE Kynurenic acid derivatives inhibit the binding of nerve growth factor (NGF) to the low-affinity p75 NGF receptor. J Med Chem38:4439-45 (1995) Tumor necrosis factor receptor superfamily member 16
Name:Tumor necrosis factor receptor superfamily member 16
Type:PROTEIN
Mol. Mass.:45159.83
Organism:Homo sapiens (Human)
Description:ChEMBL_346884
Residue:427
BDBM50029496
NameBDBM50029496
Synonyms:6-Amino-4-oxo-1,4-dihydro-quinoline-2-carboxylic acid | CHEMBL139216
TypeSmall organic molecule
Emp. Form.C10H8N2O3
Mol. Mass.204.1821
SMILESNc1ccc2nc(cc(O)c2c1)C(O)=O