Reaction Details
TargetProthrombin
LigandBDBM50029508
Substrate/Competitorn/a
Meas. Tech.ChEMBL_210582 (CHEMBL816532)
IC50 62000±n/a nM
Citation Shuman, RTRothenberger, RBCampbell, CSSmith, GFGifford-Moore, DSPaschal, JWGesellchen, PD Structure-activity study of tripeptide thrombin inhibitors using alpha-alkyl amino acids and other conformationally constrained amino acid substitutions. J Med Chem38:4446-53 (1995) Prothrombin
Name:Prothrombin
Type:Enzyme
Mol. Mass.:70502.73
Organism:Bos taurus (Bovine)
Description:P00735
Residue:625
BDBM50029508
NameBDBM50029508
Synonyms:1N-[1-{2-[4-amino(imino)methylamino-1-formyl-(1S)-butylcarbamoyl]-1-azetanylcarbonyl}-1-phenyl-(1R)-propyl]-2,2,2-trifluoroacetamide | CHEMBL2370863
TypeSmall organic molecule
Emp. Form.C22H29F3N6O4
Mol. Mass.498.4987
SMILES[#6]-[#6][C@]([#7]-[#6](=O)C(F)(F)F)([#6](=O)-[#7]-1-[#6]-[#6]-[#6@H]-1-[#6](=O)-[#7]-[#6@@H](-[#6]-[#6]-[#6]\[#7]=[#6](\[#7])-[#7])-[#6]=O)c1ccccc1