Reaction Details
TargetCoagulation factor X
LigandBDBM50029507
Substrate/Competitorn/a
Meas. Tech.ChEMBL_48475 (CHEMBL663037)
IC50 22.0±n/a nM
Citation Shuman, RTRothenberger, RBCampbell, CSSmith, GFGifford-Moore, DSPaschal, JWGesellchen, PD Structure-activity study of tripeptide thrombin inhibitors using alpha-alkyl amino acids and other conformationally constrained amino acid substitutions. J Med Chem38:4446-53 (1995) Coagulation factor X
Name:Coagulation factor X
Type:PROTEIN
Mol. Mass.:54498.45
Organism:Bos taurus
Description:ChEMBL_1364435
Residue:492
BDBM50029507
NameBDBM50029507
Synonyms:CHEMBL2370860 | {(R)-2-[2-((S)-1-Formyl-4-guanidino-butylcarbamoyl)-azetidin-1-yl]-1-methyl-2-oxo-1-phenyl-ethyl}-carbamic acid tert-butyl ester
TypeSmall organic molecule
Emp. Form.C24H36N6O5
Mol. Mass.488.5798
SMILES[#6]C([#6])([#6])[#8]-[#6](=O)-[#7][C@@]([#6])([#6](=O)-[#7]-1-[#6]-[#6]-[#6@H]-1-[#6](=O)-[#7]-[#6@@H](-[#6]-[#6]-[#6]\[#7]=[#6](\[#7])-[#7])-[#6]=O)c1ccccc1