Reaction Details
TargetSerine protease 1
LigandBDBM50029513
Substrate/Competitorn/a
Meas. Tech.ChEMBL_212346 (CHEMBL816793)
IC50 3300±n/a nM
Citation Shuman, RTRothenberger, RBCampbell, CSSmith, GFGifford-Moore, DSPaschal, JWGesellchen, PD Structure-activity study of tripeptide thrombin inhibitors using alpha-alkyl amino acids and other conformationally constrained amino acid substitutions. J Med Chem38:4446-53 (1995) Serine protease 1
Name:Serine protease 1
Type:Enzyme
Mol. Mass.:25790.52
Organism:Bos taurus (bovine)
Description:P00760
Residue:246
BDBM50029513
NameBDBM50029513
Synonyms:(S)-1-((4aS,8aS)-Decahydro-isoquinoline-3-carbonyl)-pyrrolidine-2-carboxylic acid ((S)-1-formyl-4-guanidino-butyl)-amide | CHEMBL2370865
TypeSmall organic molecule
Emp. Form.C21H36N6O3
Mol. Mass.420.5489
SMILES[H][C@]12CCCC[C@@]1([H])C[C@H](NC2)C(=O)N1CCC[C@H]1C(=O)N[C@@H](CCCNC(N)=N)C=O