Reaction Details
TargetTissue-type plasminogen activator
LigandBDBM50029514
Substrate/Competitorn/a
Meas. Tech.ChEMBL_208051 (CHEMBL812493)
IC50 250000±n/a nM
Citation Shuman, RTRothenberger, RBCampbell, CSSmith, GFGifford-Moore, DSPaschal, JWGesellchen, PD Structure-activity study of tripeptide thrombin inhibitors using alpha-alkyl amino acids and other conformationally constrained amino acid substitutions. J Med Chem38:4446-53 (1995) Tissue-type plasminogen activator
Name:Tissue-type plasminogen activator
Type:Enzyme
Mol. Mass.:62931.08
Organism:Homo sapiens (Human)
Description:n/a
Residue:562
BDBM50029514
NameBDBM50029514
Synonyms:(S)-1-((R)-2-Acetylamino-2-phenyl-propionyl)-azetidine-2-carboxylic acid ((S)-1-formyl-4-guanidino-butyl)-amide | CHEMBL337799
TypeSmall organic molecule
Emp. Form.C21H30N6O4
Mol. Mass.430.5007
SMILESCC(=O)N[C@@](C)(C(=O)N1CC[C@H]1C(=O)N[C@@H](CCCNC(N)=N)C=O)c1ccccc1