Reaction Details
TargetCoagulation factor X
LigandBDBM50029503
Substrate/Competitorn/a
Meas. Tech.ChEMBL_48475 (CHEMBL663037)
IC50 500000±n/a nM
Citation Shuman, RTRothenberger, RBCampbell, CSSmith, GFGifford-Moore, DSPaschal, JWGesellchen, PD Structure-activity study of tripeptide thrombin inhibitors using alpha-alkyl amino acids and other conformationally constrained amino acid substitutions. J Med Chem38:4446-53 (1995) Coagulation factor X
Name:Coagulation factor X
Type:PROTEIN
Mol. Mass.:54498.45
Organism:Bos taurus
Description:ChEMBL_1364435
Residue:492
BDBM50029503
NameBDBM50029503
Synonyms:(S)-1-((S)-1,2,3,4-Tetrahydro-isoquinoline-3-carbonyl)-pyrrolidine-2-carboxylic acid ((S)-1-formyl-4-guanidino-1-methyl-butyl)-amide | CHEMBL343518
TypeSmall organic molecule
Emp. Form.C22H32N6O3
Mol. Mass.428.5279
SMILESC[C@@](CCCNC(N)=N)(NC(=O)[C@@H]1CCCN1C(=O)[C@@H]1Cc2ccccc2CN1)C=O