Reaction Details
TargetProthrombin
LigandBDBM50029512
Substrate/Competitorn/a
Meas. Tech.ChEMBL_210582 (CHEMBL816532)
IC50 290±n/a nM
Citation Shuman, RTRothenberger, RBCampbell, CSSmith, GFGifford-Moore, DSPaschal, JWGesellchen, PD Structure-activity study of tripeptide thrombin inhibitors using alpha-alkyl amino acids and other conformationally constrained amino acid substitutions. J Med Chem38:4446-53 (1995) Prothrombin
Name:Prothrombin
Type:Enzyme
Mol. Mass.:70502.73
Organism:Bos taurus (Bovine)
Description:P00735
Residue:625
BDBM50029512
NameBDBM50029512
Synonyms:CHEMBL139910 | tert-butyloxy carbonyl-D-Phe-DL-Pro(5,5-methyl)-Arg-H
TypeSmall organic molecule
Emp. Form.C27H42N6O5
Mol. Mass.530.6596
SMILESCC(C)(C)OC(=O)N[C@@H](Cc1ccccc1)C(=O)N1C(CCC1(C)C)C(=O)N[C@@H](CCCNC(N)=N)C=O