Reaction Details
TargetPolyunsaturated fatty acid 5-lipoxygenase
LigandBDBM50029562
Substrate/Competitorn/a
Meas. Tech.ChEMBL_3832 (CHEMBL618017)
IC50 95.0±n/a nM
Citation Hutchinson, JHCharleson, SEvans, JFFalgueyret, JPHoogsteen, KJones, TRKargman, SMacdonald, DMcFarlane, CSNicholson, DW Thiopyranol[2,3,4-c,d]indoles as inhibitors of 5-lipoxygenase, 5-lipoxygenase-activating protein, and leukotriene C4 synthase. J Med Chem38:4538-47 (1995) Polyunsaturated fatty acid 5-lipoxygenase
Name:Polyunsaturated fatty acid 5-lipoxygenase
Type:Enzyme
Mol. Mass.:77972.74
Organism:Homo sapiens (Human)
Description:Recombinant protein was purified from E. coli lysate. After ammonium sulfate precipitation and subsequent steps, the supernatant (S100) was used for 5-LO activity assay.
Residue:674
BDBM50029562
NameBDBM50029562
Synonyms:CHEMBL140915 | {2-[1-(3-Chloro-benzyl)-4-methyl-6-(5-phenyl-pyridin-2-ylmethoxy)-4,5-dihydro-1H-thiopyrano[2,3,4-cd]indol-2-ylmethoxy]-phenyl}-acetic acid
TypeSmall organic molecule
Emp. Form.C39H33ClN2O4S
Mol. Mass.661.208
SMILESCC1Cc2c(OCc3ccc(cn3)-c3ccccc3)ccc3n(Cc4cccc(Cl)c4)c(COc4ccccc4CC(O)=O)c(S1)c23