Reaction Details
TargetProstaglandin G/H synthase 2
LigandBDBM50029623
Substrate/Competitorn/a
Meas. Tech.ChEMBL_159606 (CHEMBL760088)
IC50 3±n/a nM
Citation Li, JJAnderson, GDBurton, EGCogburn, JNCollins, JTGarland, DJGregory, SAHuang, HCIsakson, PCKoboldt, CM 1,2-Diarylcyclopentenes as selective cyclooxygenase-2 inhibitors and orally active anti-inflammatory agents. J Med Chem38:4570-8 (1995) Prostaglandin G/H synthase 2
Name:Prostaglandin G/H synthase 2
Type:Enzyme
Mol. Mass.:69003.89
Organism:Homo sapiens (Human)
Description:Recombinant Cox-2 provided by Cayman (Cayman Chemical Co.,Ann Arbor, MI).
Residue:604
BDBM50029623
NameBDBM50029623
Synonyms:1-chloro-4-[2-(4-methylsulfonylphenyl)-1-cyclopentenyl]benzene | CHEMBL340573
TypeSmall organic molecule
Emp. Form.C18H17ClO2S
Mol. Mass.332.844
SMILESCS(=O)(=O)c1ccc(cc1)C1=C(CCC1)c1ccc(Cl)cc1