Reaction Details
TargetReverse transcriptase/RNaseH
LigandBDBM10904
Substrate/Competitorn/a
Meas. Tech.ChEMBL_195839 (CHEMBL799138)
IC50 400±n/a nM
Citation Dollé, VFan, ENguyen, CHAubertin, AMKirn, AAndreola, MLJamieson, GTarrago-Litvak, LBisagni, E A new series of pyridinone derivatives as potent non-nucleoside human immunodeficiency virus type 1 specific reverse transcriptase inhibitors. J Med Chem38:4679-86 (1995) Reverse transcriptase/RNaseH
Name:Reverse transcriptase/RNaseH
Type:PROTEIN
Mol. Mass.:65229.15
Organism:Human immunodeficiency virus 1
Description:ChEMBL_1473730
Residue:566
BDBM10904
NameBDBM10904
Synonyms:1-[(benzyloxy)methyl]-5-methyl-6-(phenylsulfanyl)-1,2,3,4-tetrahydropyrimidine-2,4-dione BPT | CHEMBL37067
TypeSmall organic molecule
Emp. Form.C19H18N2O3S
Mol. Mass.354.423
SMILESCc1c(Sc2ccccc2)n(COCc2ccccc2)c(=O)[nH]c1=O