Reaction Details
TargetReverse transcriptase/RNaseH
LigandBDBM50029662
Substrate/Competitorn/a
Meas. Tech.ChEMBL_195839 (CHEMBL799138)
IC50 15±n/a nM
Citation Dollé, VFan, ENguyen, CHAubertin, AMKirn, AAndreola, MLJamieson, GTarrago-Litvak, LBisagni, E A new series of pyridinone derivatives as potent non-nucleoside human immunodeficiency virus type 1 specific reverse transcriptase inhibitors. J Med Chem38:4679-86 (1995) Reverse transcriptase/RNaseH
Name:Reverse transcriptase/RNaseH
Type:PROTEIN
Mol. Mass.:65229.15
Organism:Human immunodeficiency virus 1
Description:ChEMBL_1473730
Residue:566
BDBM50029662
NameBDBM50029662
Synonyms:3-Amino-4-(3,5-dimethyl-phenylsulfanyl)-5-ethyl-6-methyl-1H-pyridin-2-one | CHEMBL336237
TypeSmall organic molecule
Emp. Form.C16H20N2OS
Mol. Mass.288.408
SMILESCCc1c(C)[nH]c(=O)c(N)c1Sc1cc(C)cc(C)c1