Reaction Details
TargetNeutrophil elastase
LigandBDBM50029697
Substrate/Competitorn/a
Meas. Tech.ChEMBL_64004 (CHEMBL672345)
Ki 14±n/a nM
Citation Hlasta, DJAckerman, JHCourt, JJFarrell, RPJohnson, JAKofron, JLRobinson, DTTalomie, TGDunlap, RPFranke, CA A novel class of cyclic beta-dicarbonyl leaving groups and their use in the design of benzisothiazolone human leukocyte elastase inhibitors. J Med Chem38:4687-92 (1995) Neutrophil elastase
Name:Neutrophil elastase
Type:Enzyme
Mol. Mass.:28532.38
Organism:Homo sapiens (Human)
Description:P08246
Residue:267
BDBM50029697
NameBDBM50029697
Synonyms:3-Chloro-2-(1,1,3-trioxo-1,3-dihydro-1lambda*6*-benzo[d]isothiazol-2-ylmethoxy)-pyrido[1,2-a]pyrimidin-4-one | CHEMBL424111
TypeSmall organic molecule
Emp. Form.C16H10ClN3O5S
Mol. Mass.391.786
SMILESClc1c(OCN2C(=O)c3ccccc3S2(=O)=O)nc2ccccn2c1=O