Reaction Details
TargetNeutrophil elastase
LigandBDBM50029706
Substrate/Competitorn/a
Meas. Tech.ChEMBL_64004 (CHEMBL672345)
Ki 0.11±n/a nM
Citation Hlasta, DJAckerman, JHCourt, JJFarrell, RPJohnson, JAKofron, JLRobinson, DTTalomie, TGDunlap, RPFranke, CA A novel class of cyclic beta-dicarbonyl leaving groups and their use in the design of benzisothiazolone human leukocyte elastase inhibitors. J Med Chem38:4687-92 (1995) Neutrophil elastase
Name:Neutrophil elastase
Type:Enzyme
Mol. Mass.:28532.38
Organism:Homo sapiens (Human)
Description:P08246
Residue:267
BDBM50029706
NameBDBM50029706
Synonyms:2-(4-Isopropyl-6-methoxy-1,1,3-trioxo-1,3-dihydro-1lambda*6*-benzo[d]isothiazol-2-ylmethoxy)-6,7,8,9-tetrahydro-pyrido[1,2-a]pyrimidin-4-one | CHEMBL143365
TypeSmall organic molecule
Emp. Form.C20H23N3O6S
Mol. Mass.433.478
SMILESCOc1cc2c(C(=O)N(COc3cc(=O)n4CCCCc4n3)S2(=O)=O)c(c1)C(C)C