Reaction Details
TargetNeutrophil elastase
LigandBDBM50029717
Substrate/Competitorn/a
Meas. Tech.ChEMBL_64004 (CHEMBL672345)
Ki 0.025±n/a nM
Citation Hlasta, DJAckerman, JHCourt, JJFarrell, RPJohnson, JAKofron, JLRobinson, DTTalomie, TGDunlap, RPFranke, CA A novel class of cyclic beta-dicarbonyl leaving groups and their use in the design of benzisothiazolone human leukocyte elastase inhibitors. J Med Chem38:4687-92 (1995) Neutrophil elastase
Name:Neutrophil elastase
Type:Enzyme
Mol. Mass.:28532.38
Organism:Homo sapiens (Human)
Description:P08246
Residue:267
BDBM50029717
NameBDBM50029717
Synonyms:2-(3-Chloro-6-methyl-2-oxo-2H-pyran-4-yloxymethyl)-4-isopropyl-6-methoxy-1,1-dioxo-1,2-dihydro-1lambda*6*-benzo[d]isothiazol-3-one | CHEMBL344940
TypeSmall organic molecule
Emp. Form.C18H18ClNO7S
Mol. Mass.427.856
SMILESCOc1cc2c(C(=O)N(COc3cc(C)oc(=O)c3Cl)S2(=O)=O)c(c1)C(C)C