Reaction Details
TargetNeutrophil elastase
LigandBDBM50029716
Substrate/Competitorn/a
Meas. Tech.ChEMBL_64004 (CHEMBL672345)
Ki 0.14±n/a nM
Citation Hlasta, DJAckerman, JHCourt, JJFarrell, RPJohnson, JAKofron, JLRobinson, DTTalomie, TGDunlap, RPFranke, CA A novel class of cyclic beta-dicarbonyl leaving groups and their use in the design of benzisothiazolone human leukocyte elastase inhibitors. J Med Chem38:4687-92 (1995) Neutrophil elastase
Name:Neutrophil elastase
Type:Enzyme
Mol. Mass.:28532.38
Organism:Homo sapiens (Human)
Description:P08246
Residue:267
BDBM50029716
NameBDBM50029716
Synonyms:2-(1-Benzyl-5-oxo-2,5-dihydro-1H-pyrrol-3-yloxymethyl)-4-isopropyl-6-methoxy-1,1-dioxo-1,2-dihydro-1lambda*6*-benzo[d]isothiazol-3-one | CHEMBL343281
TypeSmall organic molecule
Emp. Form.C23H24N2O6S
Mol. Mass.456.511
SMILESCOc1cc2c(C(=O)N(COC3=CC(=O)N(Cc4ccccc4)C3)S2(=O)=O)c(c1)C(C)C