Reaction Details
TargetType-1 angiotensin II receptor
LigandBDBM50029904
Substrate/Competitorn/a
Meas. Tech.ChEMBL_35272 (CHEMBL648577)
Ki>4±n/a nM
Citation Salimbeni, ACanevotti, RPaleari, FPoma, DCaliari, SFici, FCirillo, RRenzetti, ARSubissi, ABelvisi, L N-3-substituted pyrimidinones as potent, orally active, AT1 selective angiotensin II receptor antagonists. J Med Chem38:4806-20 (1996) Type-1 angiotensin II receptor
Name:Type-1 angiotensin II receptor
Type:PROTEIN
Mol. Mass.:41107.81
Organism:Bos taurus
Description:ChEMBL_36779
Residue:359
BDBM50029904
NameBDBM50029904
Synonyms:4'-[4-Butyl-1-(2-carboxy-benzyl)-2-methyl-6-oxo-1,6-dihydro-pyrimidin-5-ylmethyl]-biphenyl-2-carboxylic acid | CHEMBL343249
TypeSmall organic molecule
Emp. Form.C31H30N2O5
Mol. Mass.510.5803
SMILESCCCCc1nc(C)n(Cc2ccccc2C(O)=O)c(=O)c1Cc1ccc(cc1)-c1ccccc1C(O)=O