Reaction Details
TargetGag-Pol polyprotein [489-587]
LigandBDBM50030215
Substrate/Competitorn/a
Meas. Tech.ChEMBL_195686 (CHEMBL800603)
IC50 6700±n/a nM
Citation Mohan, PLoya, SAvidan, OVerma, SDhindsa, GSWong, MFHuang, PPYashiro, MBaba, MHizi, A Synthesis of naphthalenesulfonic acid small molecules as selective inhibitors of the DNA polymerase and ribonuclease H activities of HIV-1 reverse transcriptase. J Med Chem37:2513-9 (1994) Gag-Pol polyprotein [489-587]
Name:Gag-Pol polyprotein [489-587]
Type:Enzyme Subunit
Mol. Mass.:10781.16
Organism:Human immunodeficiency virus type 1
Description:P04585[489-587]
Residue:99
BDBM50030215
NameBDBM50030215
Synonyms:4-Hexadecanoylamino-naphthalene-1,5-disulfonic acid | CHEMBL82443
TypeSmall organic molecule
Emp. Form.C26H39NO7S2
Mol. Mass.541.72
(=O)Nc1ccc(c2cccc(c12)S(O)(=O)=O)S(O)(=O)=O