Reaction Details
TargetGag-Pol polyprotein [489-587]
LigandBDBM50030216
Substrate/Competitorn/a
Meas. Tech.ChEMBL_195686 (CHEMBL800603)
IC50 91300.0±n/a nM
Citation Mohan, PLoya, SAvidan, OVerma, SDhindsa, GSWong, MFHuang, PPYashiro, MBaba, MHizi, A Synthesis of naphthalenesulfonic acid small molecules as selective inhibitors of the DNA polymerase and ribonuclease H activities of HIV-1 reverse transcriptase. J Med Chem37:2513-9 (1994) Gag-Pol polyprotein [489-587]
Name:Gag-Pol polyprotein [489-587]
Type:Enzyme Subunit
Mol. Mass.:10781.16
Organism:Human immunodeficiency virus type 1
Description:P04585[489-587]
Residue:99
BDBM50030216
NameBDBM50030216
Synonyms:4-[5-(3,6-disulfo-1-naphthyloxysulfonyl)-1-naphthylsulfonyloxy]-2,7-naphthalenedisulfonic acid | CHEMBL85517
TypeSmall organic molecule
Emp. Form.C30H20O18S6
Mol. Mass.860.859
SMILESOS(=O)(=O)c1ccc2c(OS(=O)(=O)c3cccc4c(cccc34)S(=O)(=O)Oc3cc(cc4cc(ccc34)S(O)(=O)=O)S(O)(=O)=O)cc(cc2c1)S(O)(=O)=O